involution-n
type: LexicalEntry
canonical form: involution
sense: 06326748-n
part of speech: noun

06326748-n
type: LexicalConcept
in scheme: en-word.net
definition: a long and intricate and complicated grammatical construction
ili: i69670
lexfile: noun.communication
part of speech: noun
hypernym: 06324641-n