sentence-n
type: LexicalEntry
canonical form: sentence
sense: 06295743-n
part of speech: noun

06295743-n
type: LexicalConcept
in scheme: en-word.net
definition: a string of words satisfying the grammatical rules of a language
example: he always spoke in grammatical sentences
ili: i69537
lexfile: noun.communication
part of speech: noun
hypernym: 07026850-n
mero part: 06323956-n
mero part: 06325134-n