discourse-n
type: LexicalEntry
canonical form: discourse
sense: 06295430-n
part of speech: noun

06295430-n
type: LexicalConcept
in scheme: en-word.net
definition: extended verbal expression in speech or writing
ili: i69535
lexfile: noun.communication
part of speech: noun
hypernym: 06294878-n