language-n
type: LexicalEntry
canonical form: language
sense: 06293304-n
part of speech: noun

linguistic communication-n
type: LexicalEntry
canonical form: linguistic communication
sense: 06293304-n
part of speech: noun

06293304-n
type: LexicalConcept
in scheme: en-word.net
definition: a systematic means of communicating by the use of sounds or conventional symbols
example: he taught foreign languages
example: the language introduced is standard throughout the text
example: the speed with which a program can be executed depends on the language in which it is written
ili: i69527
lexfile: noun.communication
part of speech: noun
hypernym: 00033319-n