feature-n
type: LexicalEntry
canonical form: feature
sense: 06279437-n
part of speech: noun

feature article-n
type: LexicalEntry
canonical form: feature article
sense: 06279437-n
part of speech: noun

06279437-n
type: LexicalConcept
in scheme: en-word.net
definition: a special or prominent article in a newspaper or magazine
example: they ran a feature on retirement planning
ili: i69450
lexfile: noun.communication
part of speech: noun
hypernym: 06278749-n