wrinkle-n
type: LexicalEntry
canonical form: wrinkle
sense: 06261425-n
part of speech: noun

06261425-n
type: LexicalConcept
in scheme: en-word.net
definition: a clever method of doing something (especially something new and different)
ili: i69358
lexfile: noun.cognition
part of speech: noun
hypernym: 05668113-n