Christianity-n
type: LexicalEntry
canonical form: Christianity
sense: 06236188-n
part of speech: noun

Christian religion-n
type: LexicalEntry
canonical form: Christian religion
sense: 06236188-n
part of speech: noun

06236188-n
type: LexicalConcept
in scheme: en-word.net
definition: a monotheistic system of beliefs and practices based on the Old Testament and the teachings of Jesus as embodied in the New Testament and emphasizing the role of Jesus as savior
ili: i69252
lexfile: noun.cognition
part of speech: noun
hypernym: 05955536-n