reputation-n
type: LexicalEntry
canonical form: reputation
sense: 06216934-n
part of speech: noun

report-n
type: LexicalEntry
canonical form: report
sense: 06216934-n
part of speech: noun

06216934-n
type: LexicalConcept
in scheme: en-word.net
definition: the general estimation that the public has for a person
example: he acquired a reputation as an actor before he started writing
example: he was a person of bad report
ili: i69152
lexfile: noun.cognition
part of speech: noun
hypernym: 06216764-n