recognition-n
type: LexicalEntry
canonical form: recognition
sense: 06203951-n
part of speech: noun

06203951-n
type: LexicalConcept
in scheme: en-word.net
definition: an acceptance (as of a claim) as true and valid
example: the recognition of the Rio Grande as a boundary between Mexico and the United States
ili: i69083
lexfile: noun.cognition
part of speech: noun
hypernym: 06203462-n