social anthropology-n
type: LexicalEntry
canonical form: social anthropology
sense: 06156973-n
part of speech: noun

cultural anthropology-n
type: LexicalEntry
canonical form: cultural anthropology
sense: 06156973-n
part of speech: noun

06156973-n
type: LexicalConcept
in scheme: en-word.net
definition: the branch of anthropology that deals with human culture and society
ili: i68882
lexfile: noun.cognition
part of speech: noun
hypernym: 06152997-n