memory-n
type: LexicalEntry
canonical form: memory
sense: 06149719-n
part of speech: noun

06149719-n
type: LexicalConcept
in scheme: en-word.net
definition: the area of cognitive psychology that studies memory processes
example: he taught a graduate course on learning and memory
ili: i68845
lexfile: noun.cognition
part of speech: noun
hypernym: 06148033-n