computer science-n
type: LexicalEntry
canonical form: computer science
sense: 06138021-n
part of speech: noun

computing-n
type: LexicalEntry
canonical form: computing
sense: 06138021-n
part of speech: noun

06138021-n
type: LexicalConcept
in scheme: en-word.net
definition: the branch of engineering science that studies (with the aid of computers) computable processes and structures
ili: i68812
lexfile: noun.cognition
part of speech: noun
hypernym: 06134474-n