mode-n
type: LexicalEntry
canonical form: mode
sense: 06033024-n
part of speech: noun

modal value-n
type: LexicalEntry
canonical form: modal value
sense: 06033024-n
part of speech: noun

06033024-n
type: LexicalConcept
in scheme: en-word.net
definition: the most frequent value of a random variable
ili: i68433
lexfile: noun.cognition
part of speech: noun
domain topic: 06027814-n
hypernym: 06031110-n