analysis-n
type: LexicalEntry
canonical form: analysis
sense: 06023392-n
part of speech: noun

06023392-n
type: LexicalConcept
in scheme: en-word.net
definition: a branch of mathematics involving calculus and the theory of limits; sequences and series and integration and differentiation
ili: i68395
lexfile: noun.cognition
part of speech: noun
domain topic: 06009822-n
hypernym: 06023090-n