calculus-n
type: LexicalEntry
canonical form: calculus
sense: 06023090-n
part of speech: noun

infinitesimal calculus-n
type: LexicalEntry
canonical form: infinitesimal calculus
sense: 06023090-n
part of speech: noun

06023090-n
type: LexicalConcept
in scheme: en-word.net
definition: the branch of mathematics that is concerned with limits and with the differentiation and integration of functions
ili: i68394
lexfile: noun.cognition
part of speech: noun
domain topic: 06009822-n
hypernym: 06013012-n