natural science-n
type: LexicalEntry
canonical form: natural science
sense: 06009578-n
part of speech: noun

06009578-n
type: LexicalConcept
in scheme: en-word.net
definition: the sciences involved in the study of the physical world and its phenomena
ili: i68340
lexfile: noun.cognition
part of speech: noun
hypernym: 06008975-n