region-n
type: LexicalEntry
canonical form: region
sense: 06006992-n
part of speech: noun

realm-n
type: LexicalEntry
canonical form: realm
sense: 06006992-n
part of speech: noun

06006992-n
type: LexicalConcept
in scheme: en-word.net
definition: a knowledge domain that you are interested in or are communicating about
example: it was a limited realm of discourse
example: here we enter the region of opinion
example: the realm of the occult
ili: i68327
lexfile: noun.cognition
part of speech: noun
hypernym: 06008444-n