inexperience-n
type: LexicalEntry
canonical form: inexperience
sense: 05997841-n
part of speech: noun

rawness-n
type: LexicalEntry
canonical form: rawness
sense: 05997841-n
part of speech: noun

05997841-n
type: LexicalConcept
in scheme: en-word.net
definition: lack of experience and the knowledge and understanding derived from experience
example: procedural inexperience created difficulties
example: their poor behavior was due to the rawness of the troops
ili: i68294
lexfile: noun.cognition
part of speech: noun
hypernym: 05997167-n