acculturation-n
type: LexicalEntry
canonical form: acculturation
sense: 05993821-n
part of speech: noun

culture-n
type: LexicalEntry
canonical form: culture
sense: 05993821-n
part of speech: noun

05993821-n
type: LexicalConcept
in scheme: en-word.net
definition: all the knowledge and values shared by a society
ili: i68274
lexfile: noun.cognition
part of speech: noun
hypernym: 05817200-n