Platonism-n
type: LexicalEntry
canonical form: Platonism
sense: 05983431-n
part of speech: noun

realism-n
type: LexicalEntry
canonical form: realism
sense: 05983431-n
part of speech: noun

05983431-n
type: LexicalConcept
in scheme: en-word.net
definition: (philosophy) the philosophical doctrine that abstract concepts exist independent of their names
ili: i68220
lexfile: noun.cognition
part of speech: noun
domain topic: 06168062-n
hypernym: 06177044-n