ground-n
type: LexicalEntry
canonical form: ground
sense: 05939360-n
part of speech: noun

05939360-n
type: LexicalConcept
in scheme: en-word.net
definition: a relatively homogeneous percept extending back of the figure on which attention is focused
ili: i67997
lexfile: noun.cognition
part of speech: noun
hypernym: 05938922-n