hero-n
type: LexicalEntry
canonical form: hero
sense: 05938456-n
part of speech: noun

05938456-n
type: LexicalConcept
in scheme: en-word.net
definition: the principal character in a play or movie or novel or poem
ili: i67991
lexfile: noun.cognition
part of speech: noun
hypernym: 05937794-n