plant-n
type: LexicalEntry
canonical form: plant
sense: 05914674-n
part of speech: noun

05914674-n
type: LexicalConcept
in scheme: en-word.net
definition: something planted secretly for discovery by another
example: the police used a plant to trick the thieves
example: he claimed that the evidence against him was a plant
ili: i67877
lexfile: noun.cognition
part of speech: noun
hypernym: 05914396-n