speculation-n
type: LexicalEntry
canonical form: speculation
sense: 05900390-n
part of speech: noun

conjecture-n
type: LexicalEntry
canonical form: conjecture
sense: 05900390-n
part of speech: noun

05900390-n
type: LexicalConcept
in scheme: en-word.net
definition: a hypothesis that has been formed by speculating or conjecturing (usually with little hard evidence)
example: speculations about the outcome of the election
example: he dismissed it as mere conjecture
ili: i67807
lexfile: noun.cognition
part of speech: noun
hypernym: 05897536-n