compound-n
type: LexicalEntry
canonical form: compound
sense: 05878802-n
part of speech: noun

05878802-n
type: LexicalConcept
in scheme: en-word.net
definition: a whole formed by a union of two or more elements or parts
ili: i67721
lexfile: noun.cognition
part of speech: noun
hypernym: 05878206-n