vector-n
type: LexicalEntry
canonical form: vector
sense: 05873161-n
part of speech: noun

05873161-n
type: LexicalConcept
in scheme: en-word.net
definition: a variable quantity that can be resolved into components
ili: i67696
lexfile: noun.cognition
part of speech: noun
hypernym: 05866043-n