argument-n
type: LexicalEntry
canonical form: argument
sense: 05866365-n
part of speech: noun

05866365-n
type: LexicalConcept
in scheme: en-word.net
definition: a variable in a logical or mathematical expression whose value determines the dependent variable
example: if f(x)=y, x is the independent variable
ili: i67653
lexfile: noun.cognition
part of speech: noun
hypernym: 05866043-n