color-n
type: LexicalEntry
canonical form: color
sense: 05853190-n
part of speech: noun

colour-n
type: LexicalEntry
canonical form: colour
sense: 05853190-n
part of speech: noun

05853190-n
type: LexicalConcept
in scheme: en-word.net
definition: (physics) the characteristic of quarks that determines their role in the strong interaction
example: each flavor of quarks comes in three colors
ili: i67587
lexfile: noun.cognition
part of speech: noun
domain topic: 06111158-n
hypernym: 05847533-n