establishment-n
type: LexicalEntry
canonical form: establishment
sense: 05834615-n
part of speech: noun

validation-n
type: LexicalEntry
canonical form: validation
sense: 05834615-n
part of speech: noun

05834615-n
type: LexicalConcept
in scheme: en-word.net
definition: the cognitive process of establishing a valid proof
ili: i67496
lexfile: noun.cognition
part of speech: noun
hypernym: 05833063-n