reason-n
type: LexicalEntry
canonical form: reason
sense: 05827293-n
part of speech: noun

05827293-n
type: LexicalConcept
in scheme: en-word.net
definition: a fact that logically justifies some premise or conclusion
example: there is reason to believe he is lying
ili: i67459
lexfile: noun.cognition
part of speech: noun
hypernym: 05825522-n