issue-n
type: LexicalEntry
canonical form: issue
sense: 05822776-n
part of speech: noun

05822776-n
type: LexicalConcept
in scheme: en-word.net
definition: an important question that is in dispute and must be settled
example: the issue could be settled by requiring public education for everyone
example: politicians never discuss the real issues
ili: i67438
lexfile: noun.cognition
part of speech: noun
hypernym: 05817200-n