hallucination-n
type: LexicalEntry
canonical form: hallucination
sense: 05821023-n
part of speech: noun

05821023-n
type: LexicalConcept
in scheme: en-word.net
definition: an object perceived during a hallucinatory episode
example: he refused to believe that the angel was a hallucination
ili: i67428
lexfile: noun.cognition
part of speech: noun
hypernym: 05818974-n