light-n
type: LexicalEntry
canonical form: light
sense: 05815941-n
part of speech: noun

05815941-n
type: LexicalConcept
in scheme: en-word.net
definition: mental understanding as an enlightening experience
example: he finally saw the light
example: can you shed light on this problem?
ili: i67402
lexfile: noun.cognition
part of speech: noun
hypernym: 05815314-n