probe-n
type: LexicalEntry
canonical form: probe
sense: 05808619-n
part of speech: noun

investigation-n
type: LexicalEntry
canonical form: investigation
sense: 05808619-n
part of speech: noun

05808619-n
type: LexicalConcept
in scheme: en-word.net
definition: an inquiry into unfamiliar or questionable activities
example: there was a congressional probe into the scandal
ili: i67369
lexfile: noun.cognition
part of speech: noun
hypernym: 05805605-n