calculation-n
type: LexicalEntry
canonical form: calculation
sense: 05804431-n
part of speech: noun

deliberation-n
type: LexicalEntry
canonical form: deliberation
sense: 05804431-n
part of speech: noun

05804431-n
type: LexicalConcept
in scheme: en-word.net
definition: planning something carefully and intentionally
example: it was the deliberation of his act that was insulting
ili: i67347
lexfile: noun.cognition
part of speech: noun
hypernym: 05802702-n