suggestion-n
type: LexicalEntry
canonical form: suggestion
sense: 05779676-n
part of speech: noun

05779676-n
type: LexicalConcept
in scheme: en-word.net
definition: the sequential mental process in which one thought leads to another by association
ili: i67222
lexfile: noun.cognition
part of speech: noun
hypernym: 05778661-n