dream-n
type: LexicalEntry
canonical form: dream
sense: 05776803-n
part of speech: noun

dreaming-n
type: LexicalEntry
canonical form: dreaming
sense: 05776803-n
part of speech: noun

05776803-n
type: LexicalConcept
in scheme: en-word.net
definition: imaginative thoughts indulged in while awake
example: he lives in a dream that has nothing to do with reality
ili: i67208
lexfile: noun.cognition
part of speech: noun
hypernym: 05633248-n