school-n
type: LexicalEntry
canonical form: school
sense: 05765533-n
part of speech: noun

schooling-n
type: LexicalEntry
canonical form: schooling
sense: 05765533-n
part of speech: noun

05765533-n
type: LexicalConcept
in scheme: en-word.net
definition: the process of being formally educated at a school
example: what will you do when you finish school?
ili: i67156
lexfile: noun.cognition
part of speech: noun
hypernym: 05761561-n