learning-n
type: LexicalEntry
canonical form: learning
sense: 05760541-n
part of speech: noun

acquisition-n
type: LexicalEntry
canonical form: acquisition
sense: 05760541-n
part of speech: noun

05760541-n
type: LexicalConcept
in scheme: en-word.net
definition: the cognitive process of acquiring skill or knowledge
example: the child's acquisition of language
ili: i67133
lexfile: noun.cognition
part of speech: noun
hypernym: 05709891-n