fashion-n
type: LexicalEntry
canonical form: fashion
sense: 05758654-n
part of speech: noun

05758654-n
type: LexicalConcept
in scheme: en-word.net
definition: the latest and most admired style in clothes and cosmetics and behavior
ili: i67121
lexfile: noun.cognition
part of speech: noun
hypernym: 05758160-n