discrimination-n
type: LexicalEntry
canonical form: discrimination
sense: 05755999-n
part of speech: noun

secernment-n
type: LexicalEntry
canonical form: secernment
sense: 05755999-n
part of speech: noun

05755999-n
type: LexicalConcept
in scheme: en-word.net
definition: the cognitive process whereby two or more stimuli are distinguished
ili: i67110
lexfile: noun.cognition
part of speech: noun
hypernym: 05709891-n