grouping-n
type: LexicalEntry
canonical form: grouping
sense: 05741035-n
part of speech: noun

pigeonholing-n
type: LexicalEntry
canonical form: pigeonholing
sense: 05741035-n
part of speech: noun

05741035-n
type: LexicalConcept
in scheme: en-word.net
definition: a system for classifying things into groups
ili: i67033
lexfile: noun.cognition
part of speech: noun
hypernym: 05735165-n