obsession-n
type: LexicalEntry
canonical form: obsession
sense: 05708366-n
part of speech: noun

fixation-n
type: LexicalEntry
canonical form: fixation
sense: 05708366-n
part of speech: noun

05708366-n
type: LexicalConcept
in scheme: en-word.net
definition: an unhealthy and compulsive preoccupation with something or someone
ili: i66867
lexfile: noun.cognition
part of speech: noun
hypernym: 05845245-n