divine guidance-n
type: LexicalEntry
canonical form: divine guidance
sense: 05694495-n
part of speech: noun

inspiration-n
type: LexicalEntry
canonical form: inspiration
sense: 05694495-n
part of speech: noun

05694495-n
type: LexicalConcept
in scheme: en-word.net
definition: (theology) a special influence of a divinity on the minds of human beings
example: they believe that the books of Scripture were written under divine guidance
ili: i66799
lexfile: noun.cognition
part of speech: noun
domain topic: 06191860-n
hypernym: 05694286-n