orientation-n
type: LexicalEntry
canonical form: orientation
sense: 05684599-n
part of speech: noun

05684599-n
type: LexicalConcept
in scheme: en-word.net
definition: a person's awareness of self with regard to position and time and place and personal relationships
ili: i66747
lexfile: noun.cognition
part of speech: noun
hypernym: 05684449-n