volition-n
type: LexicalEntry
canonical form: volition
sense: 05660438-n
part of speech: noun

will-n
type: LexicalEntry
canonical form: will
sense: 05660438-n
part of speech: noun

05660438-n
type: LexicalConcept
in scheme: en-word.net
definition: the capability of conscious choice and decision and intention
example: the exercise of their volition we construe as revolt
  source: George Meredith
ili: i66624
lexfile: noun.cognition
part of speech: noun
hypernym: 05658174-n