conventionality-n
type: LexicalEntry
canonical form: conventionality
sense: 05658025-n
part of speech: noun

05658025-n
type: LexicalConcept
in scheme: en-word.net
definition: unoriginality as a result of being too conventional
ili: i66614
lexfile: noun.cognition
part of speech: noun
hypernym: 05657473-n