imbecility-n
type: LexicalEntry
canonical form: imbecility
sense: 05654860-n
part of speech: noun

05654860-n
type: LexicalConcept
in scheme: en-word.net
definition: retardation more severe than a moron but not as severe as an idiot
ili: i66595
lexfile: noun.cognition
part of speech: noun
exemplifies: 06730109-n
hypernym: 05654063-n