stupidity-n
type: LexicalEntry
canonical form: stupidity
sense: 05653442-n
part of speech: noun

05653442-n
type: LexicalConcept
in scheme: en-word.net
definition: a poor ability to understand or to profit from experience
ili: i66587
lexfile: noun.cognition
part of speech: noun
hypernym: 05652767-n