skill-n
type: LexicalEntry
canonical form: skill
sense: 05644732-n
part of speech: noun

science-n
type: LexicalEntry
canonical form: science
sense: 05644732-n
part of speech: noun

05644732-n
type: LexicalConcept
in scheme: en-word.net
definition: ability to produce solutions in some problem domain
example: the skill of a well-trained boxer
example: the sweet science of pugilism
ili: i66535
lexfile: noun.cognition
part of speech: noun
hypernym: 05624029-n